ip_address,name,as_number,as_org,country_code,city,version,error,dnssec,reliability,checked_at,created_at
78.101.73.142,,42298,Ooredoo Q.S.C.,QA,Doha,,,false,1.00,2023-03-13T05:54:12Z,2023-03-13T05:54:12Z
89.211.60.76,,8781,Ooredoo Q.S.C.,QA,Doha,dnsmasq-2.48,,false,1.00,2023-04-03T21:30:06Z,2023-03-14T01:16:27Z
37.211.150.188,,42298,Ooredoo Q.S.C.,QA,Doha,dnsmasq-2.76,,false,1.00,2023-03-14T18:46:51Z,2023-03-14T08:06:58Z
37.210.226.217,,42298,Ooredoo Q.S.C.,QA,Doha,,,false,1.00,2023-03-15T04:49:58Z,2023-03-14T12:16:11Z
78.101.71.168,,42298,Ooredoo Q.S.C.,QA,Doha,,,false,1.00,2023-03-15T09:57:34Z,2023-03-14T22:03:31Z
78.101.157.63,,42298,Ooredoo Q.S.C.,QA,Doha,unbound 1.4.22,,false,1.00,2023-03-15T09:58:09Z,2023-03-14T23:10:18Z
78.100.236.124,,42298,Ooredoo Q.S.C.,QA,Doha,,,false,1.00,2023-03-18T02:51:16Z,2023-03-15T07:33:01Z
178.153.15.79,,42298,Ooredoo Q.S.C.,QA,Doha,,,false,0.73,2023-04-21T21:47:26Z,2023-03-17T05:39:32Z
