ip_address,name,as_number,as_org,country_code,city,version,error,dnssec,reliability,checked_at,created_at
103.146.221.20,pubdns1.kloud.net.bd.,139904,Kloud Technologies Limited,BD,,,,true,1.00,2023-02-25T20:53:07Z,2020-11-26T06:30:05Z
103.146.221.21,pubdns2.kloud.net.bd.,139904,Kloud Technologies Limited,BD,,,,true,1.00,2023-04-20T15:41:51Z,2020-11-26T06:30:08Z
103.19.253.153,,135092,Ashraf Uddin ta Dhaka tech,BD,Dhaka,,,true,1.00,2021-09-28T05:06:44Z,2021-09-25T20:47:34Z
58.84.32.154,,138191,Weblink Communications Ltd,BD,,dnsmasq-pi-hole-2.84,,true,1.00,2021-10-01T23:01:24Z,2021-10-01T23:01:24Z
103.149.143.155,,63526,Systems Solutions & development Technologies Limited,BD,Dhaka,dnsmasq-pi-hole-2.87test2,,false,1.00,2021-10-01T23:09:39Z,2021-10-01T23:09:39Z
180.210.180.90,,138536,Premium Connectivity Limited,BD,,dnsmasq-pi-hole-2.80,,false,1.00,2021-10-01T23:12:13Z,2021-10-01T23:12:13Z
182.163.101.98,IP-101-098.bol-online.com.,9230,Bangladesh Online Ltd.,BD,Dhaka,dnsmasq-pi-hole-2.86,,false,1.00,2021-10-01T23:41:33Z,2021-10-01T23:41:33Z
103.92.84.162,,135038,Synesis IT Limited,BD,,dnsmasq-pi-hole-2.85,,false,1.00,2021-10-01T23:43:50Z,2021-10-01T23:43:50Z
180.210.180.50,,138536,Premium Connectivity Limited,BD,,dnsmasq-pi-hole-2.80,,false,1.00,2021-10-01T23:56:58Z,2021-10-01T23:56:58Z
103.112.54.34,103-112-54-34.Dhaka.carnival.com.bd.,63526,Systems Solutions & development Technologies Limited,BD,Dhaka,dnsmasq-pi-hole-2.85,,false,1.00,2021-10-02T17:59:35Z,2021-10-02T17:59:35Z
123.200.2.122,2.122.aries.link3.net.,23688,Link3 Technologies Ltd.,BD,,,,false,1.00,2021-10-03T12:27:13Z,2021-10-03T12:27:13Z
103.197.251.202,103.197.251-202.eurotelbd.net.,64043,S.M. ZAKIR HOSSAIN ta EUROtelbd Online Ltd.,BD,,9.11.3-1ubuntu1.15-Ubuntu,,false,0.99,2021-10-08T08:02:14Z,2021-10-04T19:09:28Z
180.211.192.61,,45588,"Bangladesh Telecommunications Company Limited BTCL, Nationwide PSTN Operator and Data and In",BD,Bagerhat,,,false,0.92,2021-10-23T16:00:45Z,2021-10-22T05:36:07Z
203.112.212.114,,45588,"Bangladesh Telecommunications Company Limited BTCL, Nationwide PSTN Operator and Data and In",BD,,,,false,0.09,2023-02-08T23:35:11Z,2021-10-24T04:28:56Z
103.221.254.102,,135524,university of dhaka,BD,Dhaka,,,false,1.00,2023-02-25T20:56:37Z,2021-10-24T11:07:09Z
103.130.113.129,host1.the-potato.net.,138336,THE POTATO,BD,,,,false,0.46,2021-11-01T22:02:32Z,2021-10-26T05:21:04Z
180.211.158.90,,45588,"Bangladesh Telecommunications Company Limited BTCL, Nationwide PSTN Operator and Data and In",BD,Dhaka,,,true,0.50,2023-02-25T20:56:00Z,2021-10-29T07:07:36Z
45.125.222.97,45-125-222-97.dhaka.carnival.com.bd.,63526,Systems Solutions & development Technologies Limited,BD,Dhaka,,,false,0.78,2022-12-06T20:49:18Z,2021-10-29T12:51:16Z
223.29.214.6,,64074,Alpha Broadway System,BD,,9.11.3-1ubuntu1.15-Ubuntu,,false,1.00,2021-11-02T15:19:10Z,2021-11-02T15:19:10Z
103.126.150.177,an-150-177.ashulianetwork.net.,138474,Ashulia Network,BD,,,,false,1.00,2021-11-02T15:20:49Z,2021-11-02T15:20:49Z
182.48.68.10,,63969,Race Online Limited,BD,Dhaka,,,false,0.93,2021-11-09T15:04:32Z,2021-11-06T03:26:08Z
103.142.34.34,ns1.gnetworkbd.com.,139590,Galaxy Cyber Cafe,BD,Dhaka,9.8.1-P1,,false,0.88,2022-04-07T09:18:08Z,2022-03-27T04:45:11Z
114.130.5.5,mango-pub-dns1.mango.com.bd.,17806,Tire-1 IP Transit Provider of Bangladesh,BD,,Q9-U-7.6,,true,1.00,2022-12-06T21:56:43Z,2022-04-25T22:33:29Z
114.130.5.6,mango-pub-dns2.mango.com.bd.,17806,Tire-1 IP Transit Provider of Bangladesh,BD,,,,true,1.00,2023-02-23T18:44:47Z,2022-04-25T22:33:32Z
103.143.237.206,,150165,ARK Network,BD,,,,true,1.00,2023-02-14T10:55:00Z,2022-09-28T08:06:04Z
103.178.27.84,,149289,Palash Link Technology,BD,Palash,,,true,1.00,2023-02-14T05:27:19Z,2022-09-28T18:30:04Z
103.184.172.61,,149653,Faisal Network,BD,Dhaka,,,true,1.00,2022-11-11T00:47:20Z,2022-09-28T22:35:42Z
103.97.206.42,,132869,Mohammad Mahabub Alam ta M.A Network Service,BD,Dhaka,,,true,1.00,2022-09-29T08:42:48Z,2022-09-29T08:42:48Z
103.97.204.101,,132869,Mohammad Mahabub Alam ta M.A Network Service,BD,Dhaka,,,true,1.00,2023-02-08T23:48:17Z,2022-09-29T10:54:03Z
103.179.244.31,,149455,Suncity Pathfinder,BD,,,,true,1.00,2022-09-29T18:41:18Z,2022-09-29T16:31:50Z
103.112.238.141,,137550,Power Link Dot Net,BD,Dhaka,,,true,1.00,2022-10-11T08:32:18Z,2022-09-29T17:38:57Z
103.146.85.249,,139858,ALIFA CYBER CAFE,BD,Dhaka,,,true,1.00,2022-10-19T23:49:31Z,2022-09-30T01:12:43Z
103.97.206.57,,132869,Mohammad Mahabub Alam ta M.A Network Service,BD,Dhaka,,,true,1.00,2022-11-29T23:32:54Z,2022-09-30T01:19:31Z
103.97.204.189,,132869,Mohammad Mahabub Alam ta M.A Network Service,BD,Dhaka,,,true,0.95,2022-10-26T12:31:48Z,2022-09-30T03:24:06Z
203.76.222.107,,134204,Business Network,BD,Dhaka,,,true,1.00,2022-09-30T06:40:38Z,2022-09-30T06:40:38Z
103.173.10.117,,135308,MS DIGITAL TELECOM,BD,,,,true,1.00,2022-09-30T06:50:38Z,2022-09-30T06:50:38Z
103.168.90.81,,142436,Micro Network,BD,Dhaka,,,true,1.00,2022-09-30T07:40:54Z,2022-09-30T07:40:54Z
103.186.53.215,,132073,Wave Net,BD,,,,true,1.00,2022-09-30T07:41:14Z,2022-09-30T07:41:14Z
103.91.53.145,,133945,Md. Ahasan Kabir Choudhury ta Gaibandha Online,BD,Gaibandha,,,false,1.00,2022-09-30T09:40:03Z,2022-09-30T08:20:15Z
103.97.205.101,,132869,Mohammad Mahabub Alam ta M.A Network Service,BD,Dhaka,,,true,1.00,2022-12-13T07:09:56Z,2022-09-30T08:36:38Z
103.25.122.140,,64072,EVOLUTION NET Internet Service Provider,BD,Dhaka,,,true,0.99,2022-10-07T06:30:46Z,2022-09-30T09:57:43Z
103.97.207.0,,132869,Mohammad Mahabub Alam ta M.A Network Service,BD,Dhaka,,,true,1.00,2023-02-08T23:47:37Z,2022-09-30T12:07:54Z
103.97.207.126,,132869,Mohammad Mahabub Alam ta M.A Network Service,BD,Dhaka,,,true,0.93,2022-10-18T15:31:23Z,2022-09-30T12:28:51Z
103.186.52.208,,132073,Wave Net,BD,,,,true,0.98,2022-11-08T13:35:37Z,2022-09-30T12:31:16Z
202.133.88.236,,134180,Md. Shariful Islam TA BRISK SYSTEMS,BD,,9.11.3-1ubuntu1.13-Ubuntu,,false,0.88,2022-10-11T08:30:59Z,2022-09-30T13:37:18Z
103.74.228.39,,134180,Md. Shariful Islam TA BRISK SYSTEMS,BD,,,,true,0.96,2022-10-07T06:30:45Z,2022-09-30T14:37:36Z
103.153.49.130,,140906,MAYA SOFT,BD,Mymensingh,,,true,1.00,2022-09-30T19:10:57Z,2022-09-30T19:10:57Z
202.133.88.246,,134180,Md. Shariful Islam TA BRISK SYSTEMS,BD,,9.11.3-1ubuntu1.13-Ubuntu,,false,1.00,2022-10-01T23:36:23Z,2022-09-30T21:12:52Z
103.97.206.241,,132869,Mohammad Mahabub Alam ta M.A Network Service,BD,Dhaka,,,true,0.89,2022-10-15T06:29:58Z,2022-10-01T08:00:17Z
103.156.239.106,,133770,H M COMMUNICATION,BD,Satkhira,,,true,1.00,2022-10-03T15:37:08Z,2022-10-01T08:16:54Z
103.143.236.203,,150165,ARK Network,BD,,,,true,1.00,2022-10-02T22:34:22Z,2022-10-01T12:57:38Z
146.196.48.119,,135155,TALTOLA.NET,BD,Khilgaon,9.11.3-1ubuntu1.18-Ubuntu,,false,0.99,2022-10-07T13:32:06Z,2022-10-01T16:01:45Z
103.74.230.32,,137453,Orange Communication,BD,Dhaka,9.11.3-1ubuntu1.13-Ubuntu,,false,1.00,2022-10-01T23:36:53Z,2022-10-01T17:32:47Z
103.74.228.177,,134180,Md. Shariful Islam TA BRISK SYSTEMS,BD,,9.11.3-1ubuntu1.13-Ubuntu,,false,1.00,2022-10-02T17:36:15Z,2022-10-01T20:28:02Z
103.112.239.39,,137550,Power Link Dot Net,BD,Dhaka,,,true,0.99,2022-10-18T21:31:25Z,2022-10-01T22:30:46Z
103.166.74.83,,142060,Uttara Online,BD,,,,true,0.99,2023-03-05T21:50:07Z,2022-10-02T00:13:11Z
45.250.229.176,,134180,Md. Shariful Islam TA BRISK SYSTEMS,BD,Thakurgaon,9.11.3-1ubuntu1.13-Ubuntu,,false,1.00,2022-10-03T15:37:03Z,2022-10-02T02:37:05Z
103.58.74.236,,134204,Business Network,BD,Dhaka,,,true,1.00,2022-10-02T05:36:28Z,2022-10-02T03:33:14Z
103.91.52.106,,133945,Md. Ahasan Kabir Choudhury ta Gaibandha Online,BD,Gaibandha,,,false,1.00,2022-10-02T04:26:58Z,2022-10-02T04:26:58Z
103.89.24.216,,133547,Bit Net Technology,BD,Dhaka,,,true,1.00,2022-10-04T12:31:02Z,2022-10-02T06:06:42Z
45.249.102.48,45-249-102-48.chittagong.carnival.com.bd.,63526,Systems Solutions & development Technologies Limited,BD,Chittagong,,,false,1.00,2022-10-02T09:35:54Z,2022-10-02T07:01:07Z
103.112.64.170,,137532,Md Golam Kibria,BD,Dhaka,,,true,1.00,2022-10-04T10:42:58Z,2022-10-02T09:07:32Z
115.42.54.192,,135019,Amarnet System,BD,Dhaka,,,true,1.00,2022-10-02T17:05:36Z,2022-10-02T17:05:36Z
103.191.84.84,,150123,MS S.N.B. NET,BD,,,,true,1.00,2022-10-02T22:01:30Z,2022-10-02T22:01:30Z
103.144.49.150,,139009,Windstream Communication Limited,BD,Dhaka,,,false,1.00,2022-10-03T05:36:27Z,2022-10-03T05:36:27Z
103.186.52.210,,132073,Wave Net,BD,,,,true,1.00,2022-10-03T09:42:45Z,2022-10-03T09:42:45Z
103.178.26.202,,149289,Palash Link Technology,BD,,,,true,1.00,2022-10-03T11:07:33Z,2022-10-03T11:07:33Z
103.230.182.8,,59353,Spark Systems Ltd.,BD,Dhaka,,,true,1.00,2022-10-03T19:37:43Z,2022-10-03T19:37:43Z
103.187.39.118,,139667,Ether Techonology Network,BD,,,,true,1.00,2022-10-03T19:41:35Z,2022-10-03T19:41:35Z
103.178.26.157,,149289,Palash Link Technology,BD,,,,true,1.00,2022-10-03T20:12:24Z,2022-10-03T20:12:24Z
103.148.178.104,,140216,Bandhon Enterprise,BD,Dhaka,,,true,1.00,2022-10-03T20:22:24Z,2022-10-03T20:22:24Z
103.146.151.143,,138346,Sajid Trading Ltd.,BD,Narayanganj,,,true,1.00,2022-10-04T00:44:11Z,2022-10-03T23:42:39Z
115.42.54.135,,135019,Amarnet System,BD,Dhaka,,,true,0.94,2022-10-11T09:36:27Z,2022-10-04T03:05:21Z
103.58.74.33,,134204,Business Network,BD,Dhaka,,,true,1.00,2022-10-04T07:43:03Z,2022-10-04T07:43:03Z
103.189.144.240,,137493,ADAMDIGHI ONLINE,BD,,,,true,1.00,2022-11-11T01:44:19Z,2022-10-04T13:14:18Z
103.112.239.96,,137550,Power Link Dot Net,BD,Dhaka,,,true,1.00,2022-10-04T14:36:50Z,2022-10-04T14:36:50Z
103.145.164.77,host77.lixbd.net.net.,139814,Speed 69.Net,BD,Dhaka,,,true,1.00,2022-10-04T15:22:20Z,2022-10-04T15:22:20Z
103.143.237.136,,150165,ARK Network,BD,,,,true,0.98,2022-10-07T11:40:36Z,2022-10-04T16:13:17Z
103.199.235.4,,134180,Md. Shariful Islam TA BRISK SYSTEMS,BD,Rangpur City,9.16.1-Ubuntu,,true,1.00,2022-10-12T12:29:56Z,2022-10-11T00:57:01Z
103.167.15.220,,138346,Sajid Trading Ltd.,BD,Bangshal,,,true,0.98,2022-12-15T10:12:14Z,2022-10-11T02:30:31Z
103.145.164.218,host218.lixbd.net.net.,139814,Speed 69.Net,BD,Banaripara,,,true,0.96,2023-02-14T05:27:30Z,2022-10-11T03:26:08Z
103.153.49.54,,140906,MAYA SOFT,BD,Mymensingh,,,true,1.00,2022-10-11T12:36:39Z,2022-10-11T12:36:39Z
103.202.223.13,,134180,Md. Shariful Islam TA BRISK SYSTEMS,BD,,9.11.3-1ubuntu1.13-Ubuntu,,false,1.00,2022-10-11T13:33:33Z,2022-10-11T13:33:33Z
103.173.106.176,,147033,Liza Online,BD,,,,true,1.00,2022-10-12T22:36:30Z,2022-10-11T14:44:42Z
45.250.231.56,,134180,Md. Shariful Islam TA BRISK SYSTEMS,BD,Dhaka,,,true,1.00,2022-10-11T18:52:55Z,2022-10-11T18:52:55Z
103.112.239.255,,137550,Power Link Dot Net,BD,Dhaka,,,true,1.00,2023-02-08T23:50:35Z,2022-10-11T20:35:14Z
103.179.155.36,,140044,Base IT,BD,Savar Upazila,,,true,1.00,2022-10-12T22:36:25Z,2022-10-11T21:41:12Z
103.97.205.129,,132869,Mohammad Mahabub Alam ta M.A Network Service,BD,Dhaka,,,true,1.00,2022-10-12T02:23:51Z,2022-10-12T02:23:51Z
103.113.209.234,,137570,Md Sohel Rana,BD,Dhania,,,true,1.00,2023-02-08T23:50:30Z,2022-10-12T05:08:01Z
103.173.107.235,,147033,Liza Online,BD,Dhaka,,,true,1.00,2023-02-08T23:50:54Z,2022-10-12T13:55:07Z
103.132.182.248,,138544,HK Online,BD,Jamalpur,,,true,1.00,2023-02-08T23:51:40Z,2022-10-12T16:18:03Z
103.92.205.106,,136573,Sanjoy Saha ta Zip Cyber Cafe & Technology,BD,Dhaka,,,true,1.00,2023-02-08T23:51:32Z,2022-10-12T21:43:24Z
103.149.131.133,,140288,Toa Online,BD,,,,true,1.00,2022-10-12T22:36:19Z,2022-10-12T22:07:35Z
103.112.237.160,,137491,PEEREX NETWORKS LTD.IIG,BD,Dhaka,,,true,0.98,2022-10-17T22:32:45Z,2022-10-13T02:21:51Z
103.181.107.217,,149507,Smart Network,BD,,,,true,0.64,2022-10-17T00:39:43Z,2022-10-13T06:10:21Z
103.151.171.201,,141452,Jhongkar IT,BD,Dhaka,,,true,1.00,2022-10-13T08:40:41Z,2022-10-13T08:40:41Z
103.191.85.46,,150123,MS S.N.B. NET,BD,,,,true,1.00,2022-10-17T00:39:50Z,2022-10-13T14:45:23Z
103.183.16.25,,149633,Turag net,BD,,,,true,0.97,2022-10-16T07:30:22Z,2022-10-13T16:52:09Z
49.0.6.43,,134798,Hossain Ahmed Masum TA Alicon Network,BD,,,,true,1.00,2022-10-20T06:42:26Z,2022-10-13T17:16:55Z
103.106.58.132,visit.keznews.com.,137255,SKY NET ONLINE,BD,Dhaka,,,true,1.00,2022-10-20T15:30:53Z,2022-10-13T17:17:53Z
103.149.131.216,,140288,Toa Online,BD,,,,true,0.99,2022-10-17T16:35:04Z,2022-10-13T17:52:15Z
103.166.75.254,,142060,Uttara Online,BD,Dhaka,,,true,0.99,2022-10-17T22:32:25Z,2022-10-14T05:42:27Z
103.178.32.175,,149293,A2Z Network,BD,Dhaka,,,true,0.99,2022-10-17T22:32:25Z,2022-10-14T05:46:47Z
103.179.199.1,,10075,Fiber@Home Global Limited,BD,,,,true,0.85,2022-10-17T12:38:34Z,2022-10-14T06:10:30Z
146.196.48.2,,135155,TALTOLA.NET,BD,Khilgaon,9.11.3-1ubuntu1.18-Ubuntu,,false,0.88,2022-10-17T22:32:25Z,2022-10-14T06:12:22Z
103.106.57.16,visit.keznews.com.,137255,SKY NET ONLINE,BD,Dhaka,,,true,0.98,2022-10-19T22:32:39Z,2022-10-14T07:38:22Z
103.173.10.205,,135308,MS DIGITAL TELECOM,BD,,,,true,1.00,2022-10-14T09:36:38Z,2022-10-14T09:30:12Z
124.6.237.157,,38256,"Bengal Group Ltd. Nationwide Internet Service Provider, Bangladesh.",BD,Dhaka,,,true,1.00,2022-10-14T15:00:17Z,2022-10-14T15:00:17Z
103.92.204.38,,136573,Sanjoy Saha ta Zip Cyber Cafe & Technology,BD,Dhaka,,,true,1.00,2023-02-14T05:27:35Z,2022-10-14T17:31:47Z
103.230.182.196,,59353,Spark Systems Ltd.,BD,Dhaka,,,true,0.99,2022-10-17T22:32:37Z,2022-10-14T17:57:45Z
45.250.228.28,,134180,Md. Shariful Islam TA BRISK SYSTEMS,BD,,9.11.3-1ubuntu1.18-Ubuntu,,false,1.00,2022-10-17T16:35:54Z,2022-10-14T18:16:57Z
45.250.230.225,,134180,Md. Shariful Islam TA BRISK SYSTEMS,BD,Dhaka,,,true,1.00,2022-10-14T21:33:44Z,2022-10-14T21:33:44Z
180.148.214.181,180.148.214.181.stargatecommunications.com.,45905,Stargate Communications Ltd.,BD,Paltan,,,false,1.00,2022-10-15T03:22:20Z,2022-10-15T03:22:20Z
103.97.204.116,,132869,Mohammad Mahabub Alam ta M.A Network Service,BD,Dhaka,,,true,1.00,2022-10-15T03:32:02Z,2022-10-15T03:32:02Z
103.199.234.175,,134180,Md. Shariful Islam TA BRISK SYSTEMS,BD,Rangpur City,9.16.1-Ubuntu,,true,1.00,2022-10-15T05:01:55Z,2022-10-15T05:01:55Z
103.204.244.171,,134990,CiTYCOM Network,BD,,9.11.3-1ubuntu1.16-Ubuntu,,false,0.50,2023-02-14T18:05:43Z,2022-10-15T06:30:28Z
103.85.112.43,,136257,New CNS Online,BD,Dhaka,,,true,1.00,2023-02-08T23:51:10Z,2022-10-15T07:45:58Z
103.183.116.240,,149644,Z S NET,BD,Dhaka,,,true,0.99,2022-10-19T10:30:54Z,2022-10-15T09:59:31Z
103.178.33.125,,149293,A2Z Network,BD,Dhaka,,,true,1.00,2022-10-17T01:35:53Z,2022-10-15T12:08:16Z
103.157.237.178,,139347,Md Masud Rana Roni ta RV Cyber World,BD,Dinajpur,,,true,1.00,2022-10-16T13:35:36Z,2022-10-15T13:10:42Z
116.204.148.148,,137967,Digicon Telecommunication Ltd,BD,Dhaka,,,true,1.00,2022-10-16T13:35:37Z,2022-10-15T13:13:51Z
103.178.33.64,,149293,A2Z Network,BD,Dhaka,,,true,0.97,2022-10-20T15:30:53Z,2022-10-15T14:31:08Z
103.209.197.154,,134180,Md. Shariful Islam TA BRISK SYSTEMS,BD,Dhaka,,,true,1.00,2022-10-15T20:36:27Z,2022-10-15T20:36:27Z
103.202.221.12,,134180,Md. Shariful Islam TA BRISK SYSTEMS,BD,Dhaka,,,true,1.00,2022-10-16T15:36:30Z,2022-10-15T22:33:35Z
103.190.43.24,,149988,I Logistic,BD,,,,true,0.98,2022-10-25T15:40:35Z,2022-10-16T00:49:06Z
103.142.70.66,,139602,Micro Link,BD,Narayanganj,,,false,1.00,2022-10-16T06:31:22Z,2022-10-16T04:50:30Z
103.92.206.113,,136573,Sanjoy Saha ta Zip Cyber Cafe & Technology,BD,Dhaka,,,true,1.00,2023-02-08T23:54:41Z,2022-10-16T05:51:06Z
45.250.230.196,,134180,Md. Shariful Islam TA BRISK SYSTEMS,BD,Dhaka,,,true,0.94,2022-10-22T00:33:22Z,2022-10-16T07:53:06Z
202.91.43.155,,136224,City Online Ltd.,BD,Dhaka,,,true,1.00,2023-02-08T23:53:57Z,2022-10-16T08:49:22Z
103.173.106.196,,147033,Liza Online,BD,,,,true,1.00,2022-10-16T10:07:22Z,2022-10-16T10:07:22Z
103.183.16.254,,149633,Turag net,BD,,,,true,1.00,2022-10-17T06:36:56Z,2022-10-16T13:12:20Z
103.179.14.63,,149418,MSM Online,BD,,,,true,1.00,2022-10-16T20:52:56Z,2022-10-16T20:52:56Z
103.82.172.21,,136164,Islamic University of Technology IUT,BD,,,,false,1.00,2022-10-17T00:48:35Z,2022-10-17T00:48:35Z
144.48.115.104,,58715,EARTH TELECOMMUNICATION Pvt LTD.,BD,Dhaka,,,true,0.98,2022-10-27T10:36:22Z,2022-10-17T03:03:05Z
157.119.236.0,,134990,CiTYCOM Network,BD,Dhaka,9.11.3-1ubuntu1.16-Ubuntu,,false,1.00,2022-10-17T22:35:18Z,2022-10-17T05:16:38Z
103.157.237.143,,139347,Md Masud Rana Roni ta RV Cyber World,BD,Dinajpur,,,true,1.00,2022-10-17T22:32:29Z,2022-10-17T06:01:03Z
202.133.89.46,,134180,Md. Shariful Islam TA BRISK SYSTEMS,BD,Dhaka,9.11.3-1ubuntu1.18-Ubuntu,,false,0.98,2022-10-17T22:35:10Z,2022-10-17T06:13:48Z
103.170.172.164,,142595,AG Communication,BD,Dhaka,,,true,1.00,2022-10-17T11:34:24Z,2022-10-17T08:55:56Z
103.150.68.167,,138974,MESH NETWORK,BD,Dhaka,,,true,1.00,2022-10-17T12:17:25Z,2022-10-17T12:17:25Z
103.178.73.235,,132008,E-JOGAJOG,BD,,,,true,0.99,2022-10-30T04:30:37Z,2022-10-17T17:20:53Z
103.148.52.175,,140080,A1 Cyberlink,BD,Narayanganj,,,true,1.00,2022-10-17T17:54:43Z,2022-10-17T17:54:43Z
103.164.38.69,,141991,Benapole Net,BD,,9.11.3-1ubuntu1.17-Ubuntu,,false,0.92,2022-10-19T06:33:38Z,2022-10-17T20:15:11Z
103.166.47.106,,132294,Elenga Dot Net,BD,Dhaka,,,true,0.96,2022-10-18T21:30:23Z,2022-10-18T00:29:09Z
103.178.33.226,,149293,A2Z Network,BD,Dhaka,,,true,0.95,2022-10-19T06:31:13Z,2022-10-18T04:00:48Z
115.42.54.246,,135019,Amarnet System,BD,Dhaka,,,true,0.99,2022-10-25T17:41:05Z,2022-10-18T06:33:57Z
123.136.25.243,host-243-25-136-123.pacenet.net.,38493,Royal Green Communication Limited,BD,Dhaka,,,false,1.00,2022-10-18T11:11:36Z,2022-10-18T11:11:36Z
103.146.55.133,,139850,Hi-Tec Enterprise,BD,Dhaka,,,true,1.00,2023-02-08T23:55:02Z,2022-10-18T18:56:35Z
103.25.122.8,,64072,EVOLUTION NET Internet Service Provider,BD,Dhaka,,,true,1.00,2022-10-19T06:36:30Z,2022-10-18T19:54:05Z
103.136.202.92,,138692,Polly IT,BD,Araihazar,,,true,1.00,2022-10-18T21:01:18Z,2022-10-18T21:01:18Z
103.192.157.27,host27.cityonlinebd.net.,136224,City Online Ltd.,BD,Dhaka,,,true,1.00,2023-02-19T01:02:57Z,2022-10-19T03:46:07Z
103.103.35.240,,137048,X-LINK LIMITED,BD,Dhaka,,,true,1.00,2022-10-21T15:35:51Z,2022-10-19T06:29:46Z
103.7.248.54,,10075,Fiber@Home Global Limited,BD,Gopalganj,,,false,1.00,2022-10-19T08:38:04Z,2022-10-19T08:38:04Z
103.214.201.182,,137453,Orange Communication,BD,,,,true,1.00,2022-10-19T10:03:17Z,2022-10-19T10:03:17Z
45.252.54.53,,135517,Pandora Technology,BD,,,,true,1.00,2022-10-19T10:09:02Z,2022-10-19T10:09:02Z
103.110.64.23,,137480,Planet Web,BD,Dhaka,,,false,1.00,2022-10-19T10:16:22Z,2022-10-19T10:16:22Z
103.149.131.187,,140288,Toa Online,BD,,,,true,1.00,2023-02-14T09:53:24Z,2022-10-19T13:24:49Z
103.179.199.21,,10075,Fiber@Home Global Limited,BD,,,,true,1.00,2022-10-19T22:34:58Z,2022-10-19T21:47:51Z
103.159.73.85,,141433,Netcom Internet Service,BD,Dhaka,,,true,1.00,2022-10-19T22:38:57Z,2022-10-19T22:38:57Z
103.112.239.250,,137550,Power Link Dot Net,BD,Dhaka,,,true,1.00,2023-02-08T23:58:15Z,2022-10-20T09:08:16Z
103.113.208.24,,137570,Md Sohel Rana,BD,Dhaka,,,true,1.00,2022-10-20T10:43:04Z,2022-10-20T10:43:04Z
103.25.122.224,,64072,EVOLUTION NET Internet Service Provider,BD,Dhaka,,,true,1.00,2022-10-20T22:34:05Z,2022-10-20T11:03:42Z
103.143.237.85,,150165,ARK Network,BD,,,,true,1.00,2023-02-08T23:57:53Z,2022-10-20T15:02:46Z
103.156.67.200,,141198,TLink Communication,BD,Dhaka,9.11.3-1ubuntu1.17-Ubuntu,,false,0.96,2022-10-26T00:35:03Z,2022-10-20T19:23:06Z
103.179.239.175,,149453,Tufan Online,BD,Mirpur,9.11.3-1ubuntu1.18-Ubuntu,,false,1.00,2023-02-14T05:27:40Z,2022-10-20T21:51:41Z
103.178.27.232,,149289,Palash Link Technology,BD,,,,true,1.00,2022-10-22T18:38:58Z,2022-10-20T22:28:00Z
103.89.24.211,,133547,Bit Net Technology,BD,,,,true,1.00,2023-02-08T23:57:48Z,2022-10-21T02:01:24Z
49.0.4.177,,134798,Hossain Ahmed Masum TA Alicon Network,BD,,,,true,0.99,2022-10-26T08:31:09Z,2022-10-21T03:49:29Z
103.145.164.231,host231.lixbd.net.net.,139814,Speed 69.Net,BD,Dhaka,,,true,1.00,2022-10-21T08:12:47Z,2022-10-21T08:12:47Z
103.6.251.16,,150330,Breeze Online,BD,,,,true,1.00,2023-02-08T23:58:15Z,2022-10-21T14:36:47Z
103.109.236.243,,137464,Tangail City Computers,BD,,,,true,1.00,2022-10-22T06:35:30Z,2022-10-21T19:14:02Z
103.109.236.78,,137464,Tangail City Computers,BD,,,,true,0.98,2022-10-31T15:29:33Z,2022-10-21T19:53:49Z
103.155.42.130,,141038,Chauddagram Broadband,BD,Chauddagram,,,true,1.00,2022-10-22T00:08:29Z,2022-10-22T00:08:29Z
103.153.49.198,,140906,MAYA SOFT,BD,Mymensingh,,,true,1.00,2022-10-22T00:25:49Z,2022-10-22T00:25:49Z
103.106.3.164,,137245,MY NET SYSTEM,BD,,,,true,1.00,2022-10-22T00:30:17Z,2022-10-22T00:30:17Z
103.189.144.77,,137493,ADAMDIGHI ONLINE,BD,,,,true,0.99,2022-11-09T16:32:31Z,2022-10-22T05:34:59Z
103.140.234.106,visit.keznews.com.,139294,Skynet Broadband Network,BD,Tangibari,,,false,0.96,2022-10-24T07:37:15Z,2022-10-22T06:47:42Z
103.211.31.33,,135155,TALTOLA.NET,BD,Dhaka,,,true,0.98,2022-10-24T07:37:15Z,2022-10-22T12:50:25Z
103.146.151.138,,138346,Sajid Trading Ltd.,BD,Narayanganj,,,true,1.00,2022-10-22T18:38:44Z,2022-10-22T15:24:41Z
103.211.30.92,,135155,TALTOLA.NET,BD,Dhaka,,,true,0.96,2022-10-25T17:40:55Z,2022-10-22T18:19:23Z
103.153.49.69,,140906,MAYA SOFT,BD,Mymensingh,,,true,1.00,2022-10-23T01:36:33Z,2022-10-22T18:34:12Z
103.173.106.98,,147033,Liza Online,BD,,,,true,0.97,2022-11-29T23:32:53Z,2022-10-22T18:54:50Z
103.166.75.145,,142060,Uttara Online,BD,Savar Upazila,,,true,1.00,2022-12-17T13:18:43Z,2022-10-22T19:21:39Z
49.0.5.26,,134798,Hossain Ahmed Masum TA Alicon Network,BD,,,,true,0.99,2022-10-25T11:30:35Z,2022-10-22T20:04:24Z
103.97.205.49,,132869,Mohammad Mahabub Alam ta M.A Network Service,BD,Dhaka,,,true,1.00,2022-10-24T06:35:02Z,2022-10-22T20:48:10Z
103.184.173.157,,149653,Faisal Network,BD,Dhaka,,,true,1.00,2022-10-22T23:19:13Z,2022-10-22T23:19:13Z
103.129.237.135,,138205,RM NETWORK,BD,Savar Upazila,,,true,1.00,2022-10-23T01:35:44Z,2022-10-22T23:53:21Z
144.48.84.6,,141452,Jhongkar IT,BD,,,,true,1.00,2022-11-14T10:32:23Z,2022-10-23T00:03:05Z
103.166.25.109,,142054,TECH CITY COMMUNICATIONS,BD,Jamalpur,9.11.3-1ubuntu1.17-Ubuntu,,false,1.00,2022-10-23T03:59:33Z,2022-10-23T03:59:33Z
103.146.54.121,,0,,BD,,,,true,1.00,2022-10-23T04:09:13Z,2022-10-23T04:09:13Z
175.29.178.211,,17469,Access Telecom BD Ltd.,BD,Dhaka,,,true,1.00,2022-10-23T20:39:09Z,2022-10-23T06:50:32Z
103.185.224.167,,141452,Jhongkar IT,BD,,,,true,0.92,2022-10-26T06:36:22Z,2022-10-23T07:48:48Z
103.146.54.131,,0,,BD,,,,true,1.00,2022-10-24T07:37:16Z,2022-10-23T08:20:01Z
103.172.188.6,,135615,D-NET SERVICE,BD,Dhaka,,,true,1.00,2022-10-23T08:43:38Z,2022-10-23T08:43:38Z
103.166.74.45,,142060,Uttara Online,BD,Savar Upazila,,,true,1.00,2022-10-27T10:37:46Z,2022-10-23T12:51:49Z
103.191.85.168,,150123,MS S.N.B. NET,BD,,,,true,1.00,2023-02-08T23:57:41Z,2022-10-23T15:59:38Z
49.0.5.63,,134798,Hossain Ahmed Masum TA Alicon Network,BD,,,,true,1.00,2022-10-23T20:39:29Z,2022-10-23T16:18:14Z
103.106.58.4,visit.keznews.com.,137255,SKY NET ONLINE,BD,Dhaka,,,true,1.00,2022-10-24T02:35:32Z,2022-10-24T01:43:40Z
103.138.122.98,,139004,RL CAFE NET,BD,,,,true,1.00,2022-10-24T14:55:00Z,2022-10-24T14:55:00Z
103.202.52.78,,134824,OPTICAL LINK NETWORK,BD,,,,true,1.00,2022-10-25T02:36:22Z,2022-10-25T02:36:22Z
103.186.103.212,,133209,Saturn Internet Service,BD,,,,true,1.00,2022-10-25T09:02:59Z,2022-10-25T09:02:59Z
103.106.3.61,,137245,MY NET SYSTEM,BD,,,,true,1.00,2022-10-25T10:36:49Z,2022-10-25T10:36:49Z
103.191.85.56,,150123,MS S.N.B. NET,BD,,,,true,0.99,2022-11-09T12:37:12Z,2022-10-25T10:37:39Z
103.126.112.108,,138473,Sabuj Bangla Online,BD,Gendaria,,,true,1.00,2022-11-05T16:36:22Z,2022-10-25T15:58:57Z
103.190.42.76,,149988,I Logistic,BD,,,,true,0.99,2022-10-28T22:35:34Z,2022-10-25T17:55:53Z
103.97.205.111,,132869,Mohammad Mahabub Alam ta M.A Network Service,BD,Dhaka,,,true,0.99,2022-10-27T10:37:40Z,2022-10-25T21:05:55Z
103.183.116.166,,149644,Z S NET,BD,Dhaka,,,true,1.00,2022-10-26T02:01:09Z,2022-10-26T02:01:09Z
103.189.145.174,,137493,ADAMDIGHI ONLINE,BD,,,,true,1.00,2022-10-26T02:16:25Z,2022-10-26T02:16:25Z
103.166.75.255,,142060,Uttara Online,BD,Dhaka,,,true,1.00,2022-10-26T02:25:08Z,2022-10-26T02:25:08Z
103.164.38.36,,141991,Benapole Net,BD,,,,true,1.00,2022-10-26T11:39:18Z,2022-10-26T05:00:58Z